Modeling exercises
: Enhance Modeling Feedback Layout
#64885
Triggered via pull request
February 1, 2025 17:37
LeonWehrhahn
synchronize
#10238
Status
Success
Total duration
12s
Artifacts
–
Annotations
9 errors and 1 notice
de.tum.cit.aet.artemis.assessment.ResultListenerIntegrationTest ► updateExercisePoints_ShouldUpdatePointsInParticipantScores(boolean) [2] isTeamTest=false:
src/test/java/de/tum/cit/aet/artemis/assessment/ResultListenerIntegrationTest.java#L121
Failed test found in:
build/test-results/test/TEST-de.tum.cit.aet.artemis.assessment.ResultListenerIntegrationTest.xml
Error:
org.opentest4j.AssertionFailedError:
|
de.tum.cit.aet.artemis.core.service.DataExportCreationServiceTest ► testDataExportCreationSuccess_containsCorrectCourseContent():
src/test/java/de/tum/cit/aet/artemis/core/service/DataExportCreationServiceTest.java#L256
Failed test found in:
build/test-results/test/TEST-de.tum.cit.aet.artemis.core.service.DataExportCreationServiceTest.xml
Error:
java.lang.AssertionError:
|
de.tum.cit.aet.artemis.iris.IrisChatTokenTrackingIntegrationTest ► testTokenTrackingHandledExerciseChat():
src/test/java/de/tum/cit/aet/artemis/iris/IrisChatTokenTrackingIntegrationTest.java#L150
Failed test found in:
build/test-results/test/TEST-de.tum.cit.aet.artemis.iris.IrisChatTokenTrackingIntegrationTest.xml
Error:
org.opentest4j.AssertionFailedError:
|
de.tum.cit.aet.artemis.iris.IrisChatTokenTrackingIntegrationTest ► testTokenTrackingExerciseChatWithPipelineFail():
src/test/java/de/tum/cit/aet/artemis/iris/IrisChatTokenTrackingIntegrationTest.java#L201
Failed test found in:
build/test-results/test/TEST-de.tum.cit.aet.artemis.iris.IrisChatTokenTrackingIntegrationTest.xml
Error:
org.opentest4j.AssertionFailedError:
|
de.tum.cit.aet.artemis.quiz.QuizExerciseIntegrationTest ► testDeleteQuizExerciseWithSubmittedAnswers(QuizMode) [3] quizMode=INDIVIDUAL:
src/test/java/de/tum/cit/aet/artemis/core/util/RequestUtilService.java#L780
Failed test found in:
build/test-results/test/TEST-de.tum.cit.aet.artemis.quiz.QuizExerciseIntegrationTest.xml
Error:
java.lang.AssertionError: Response status expected:<200> but was:<500>
|
de.tum.cit.aet.artemis.atlas.competency.CourseCompetencyIntegrationTest$GetCompetencyCourseProgress ► shouldGetCompetencyCourseProgressWhenTeamExercise():
src/test/java/de/tum/cit/aet/artemis/atlas/competency/CourseCompetencyIntegrationTest.java#L267
Failed test found in:
build/test-results/test/TEST-de.tum.cit.aet.artemis.atlas.competency.CourseCompetencyIntegrationTest$GetCompetencyCourseProgress.xml
Error:
org.opentest4j.AssertionFailedError:
|
de.tum.cit.aet.artemis.core.service.DataExportCreationServiceTest ► testDataExportCreationSuccess_containsCorrectCourseContent():
src/test/java/de/tum/cit/aet/artemis/core/service/DataExportCreationServiceTest.java#L256
Failed test found in:
build/test-results/test/TEST-de.tum.cit.aet.artemis.core.service.DataExportCreationServiceTest.xml
Error:
java.lang.AssertionError:
|
de.tum.cit.aet.artemis.exam.ExamParticipationIntegrationTest ► testGetExamScore(boolean, boolean) [1] withCourseBonus=false, withSecondCorrectionAndStarted=false:
src/test/java/de/tum/cit/aet/artemis/exam/ExamParticipationIntegrationTest.java#L892
Failed test found in:
build/test-results/test/TEST-de.tum.cit.aet.artemis.exam.ExamParticipationIntegrationTest.xml
build/test-results/test/TEST-de.tum.cit.aet.artemis.exam.ExamParticipationIntegrationTest.xml
build/test-results/test/TEST-de.tum.cit.aet.artemis.exam.ExamParticipationIntegrationTest.xml
Error:
org.awaitility.core.ConditionTimeoutException: Condition with Lambda expression in de.tum.cit.aet.artemis.exam.ExamParticipationIntegrationTest was not fulfilled within 1 minutes.
|
de.tum.cit.aet.artemis.quiz.QuizExerciseIntegrationTest ► testDeleteQuizExerciseWithSubmittedAnswers(QuizMode) [1] quizMode=SYNCHRONIZED:
src/test/java/de/tum/cit/aet/artemis/core/util/RequestUtilService.java#L780
Failed test found in:
build/test-results/test/TEST-de.tum.cit.aet.artemis.quiz.QuizExerciseIntegrationTest.xml
build/test-results/test/TEST-de.tum.cit.aet.artemis.quiz.QuizExerciseIntegrationTest.xml
build/test-results/test/TEST-de.tum.cit.aet.artemis.quiz.QuizExerciseIntegrationTest.xml
Error:
java.lang.AssertionError: Response status expected:<200> but was:<500>
|
test#L0
Junit Results ran 8417 in 1228.0999999999995 seconds 0 Errored, 0 Failed, 0 Skipped
|